{"text_format":"1","workbook":"xlsx","n_sheets":21,"sheets":["Start Here","Dashboard","Charts & Visuals","Life Events","_val_temp","Wrappers","Allocation","State Pension","Income Streams","Monthly Tracker","Projection","Monte Carlo","Scenarios","Care Costs","Market Data","Assumptions","Disclaimer","Children & Education","Home & Property","Insurance & Protection","Asset Register"],"not_rendered":{"charts":6,"images":0,"macros":1,"external_links":0,"defined_names":0,"comments":0,"pivot_tables":0},"unopened":[],"bounds":{"document_bytes":16777216,"sheet_cells":100000,"rows_first":2000,"rows_last":500,"rows_between":2000,"halvings":0,"cell_chars":16384,"cell_head_chars":4096},"cells_cut":0,"cells_raw":0,"read":"whole","date_system":"1900"}

{"sheet":"Start Here","index":0,"n_rows":47,"n_cols":5,"rows_kept":47,"cut":false,"hidden":false,"merged":[[0,1,0,4],[1,1,1,4],[3,1,3,4],[5,2,5,3],[6,2,6,3],[7,2,7,3],[8,2,8,3],[9,2,9,3],[10,2,10,3],[11,2,11,3],[12,1,12,4],[13,2,13,3],[14,2,14,3],[15,2,15,3],[17,1,17,4],[18,1,18,4],[20,2,20,3],[21,2,21,3],[22,2,22,3],[23,2,23,3],[24,2,24,3],[25,2,25,3],[26,2,26,3],[27,2,27,3],[28,2,28,3],[29,2,29,3],[30,2,30,3],[31,2,31,3],[32,2,32,3],[34,1,34,4],[36,2,36,3],[37,2,37,3],[38,2,38,3],[39,2,39,3],[40,2,40,3],[41,2,41,3],[42,2,42,3],[44,1,44,4],[45,2,45,4],[46,1,46,4]]}
[null,"PAYSLIP TO PAYBACK"]
[null,"UK Lifetime Financial Planner  ·  Tell us where you are today"]
[]
[null,"  SECTION 1 OF 4 — ABOUT YOU"]
[null,"Question","Your Answer",null,"Guidance"]
[null,"  Your full name (optional)",null,null,"e.g. Alex Smith  —  optional, used for personalisation only"]
[null,"  Date of birth",null,null,"Format: DD/MM/YYYY  e.g. 15/06/1980"]
[null,"  Target retirement age",65,null,"e.g. 65  —  must be between 40 and 80"]
[null,"  Life expectancy planning age",90,null,"Plan to age 90 or beyond. Better to over-plan."]
[null,"  Current employment status","Employed",null,"Select from dropdown"]
{"$rows_left_out":38}
{"sheet":"Dashboard","index":1,"n_rows":28,"n_cols":7,"rows_kept":28,"cut":false,"hidden":false,"merged":[[0,1,0,6],[1,1,1,6],[3,1,3,3],[3,4,3,6],[5,1,5,6],[6,1,6,2],[6,3,6,4],[7,1,7,2],[7,3,7,4],[9,1,9,6],[10,1,10,2],[10,3,10,4],[11,1,11,2],[11,3,11,4],[12,1,12,2],[12,3,12,4],[13,1,13,2],[13,3,13,4],[14,1,14,2],[14,3,14,4],[15,1,15,2],[15,3,15,4],[23,1,23,6],[24,1,24,6],[26,1,26,6],[17,1,17,6],[18,1,18,6],[20,1,20,6],[21,1,21,6],[22,1,22,6]]}
[null,"PAYSLIP TO PAYBACK  ·  Your Lifetime Financial Plan"]
[null,"Updated monthly  ·  All figures in today's money  ·  Not financial advice"]
[]
[null,"Life Chapter: Enter your date of birth on Start Here to activate",null,null,"Set up your profile on the Start Here sheet →"]
[]
[null,"  KEY NUMBERS AT A GLANCE"]
[null,"Target Income /mth",null,"Projected Income /mth"]
[null,"Set target on Start Here",null,"Run projection to activate"]
[]
[null,"  COMPETING GOALS"]
{"$rows_left_out":19}
{"sheet":"Charts & Visuals","index":2,"n_rows":688,"n_cols":21,"rows_kept":688,"cut":false,"hidden":false,"merged":[[55,2,55,9],[55,10,55,17],[74,2,74,17],[0,2,0,17],[1,2,1,17],[3,2,3,17],[21,2,21,17],[37,2,37,9],[37,10,37,17]]}
[null,null,"CHARTS & VISUALS  ·  Your Plan at a Glance"]
[null,null,"Charts update automatically as you enter data across the workbook  ·  All values in today’s money  ·  Not financial advice"]
[]
[null,null,"  ▶  LIFETIME PROJECTION  —  Portfolio value year by year",null,null,null,null,null,null,null,null,null,null,null,null,null,null,null,"Balance"]
[null,null,null,null,null,null,null,null,null,null,null,null,null,null,null,null,null,"Workplace DC",{"$f":"Wrappers!C6","v":0}]
[null,null,null,null,null,null,null,null,null,null,null,null,null,null,null,null,null,"SIPP",{"$f":"Wrappers!C7","v":0}]
[null,null,null,null,null,null,null,null,null,null,null,null,null,null,null,null,null,"S&S ISA",{"$f":"Wrappers!C8","v":0}]
[null,null,null,null,null,null,null,null,null,null,null,null,null,null,null,null,null,"Cash ISA",{"$f":"Wrappers!C9","v":0}]
[null,null,null,null,null,null,null,null,null,null,null,null,null,null,null,null,null,"LISA",{"$f":"Wrappers!C10","v":0}]
[null,null,null,null,null,null,null,null,null,null,null,null,null,null,null,null,null,"JISA 1",{"$f":"Wrappers!C11","v":0}]
{"$rows_left_out":679}
{"sheet":"Life Events","index":3,"n_rows":58,"n_cols":6,"rows_kept":58,"cut":false,"hidden":false,"merged":[[0,1,0,5],[1,1,1,5],[3,1,3,5],[57,1,57,5]]}
[null,"LIFE EVENTS — Your Financial Biography"]
[null,"Log every significant event  ·  Your permanent financial record"]
[]
[null,"Enter events chronologically. Category dropdown: use to classify each event. Financial Impact: positive = windfall/income, negative = expense. This log is your permanent financial biography — valuable for advisers and surviving partners."]
[]
[null,"Date","Category","Description / Notes","Financial Impact (£)","Projection Updated?"]
[]
[]
[]
[]
{"$rows_left_out":49}
{"sheet":"_val_temp","index":4,"n_rows":32,"n_cols":1,"rows_kept":32,"cut":false,"hidden":true,"merged":[]}
["Relationship - Marriage/Partnership"]
["Relationship - Separation/Divorce"]
["Bereavement - Partner"]
["Bereavement - Other"]
["Employment - New Job"]
["Employment - Promotion"]
["Employment - Redundancy"]
["Employment - Career Break"]
["Employment - Return to Work"]
["Employment - Retirement"]
{"$rows_left_out":23}
{"sheet":"Wrappers","index":5,"n_rows":50,"n_cols":7,"rows_kept":50,"cut":false,"hidden":false,"merged":[[0,1,0,6],[1,1,1,6],[3,1,3,6],[15,1,15,6],[17,3,17,6],[18,3,18,6],[19,3,19,6],[20,1,20,6],[21,3,21,6],[22,3,22,6],[23,3,23,6],[24,1,24,6],[25,3,25,6],[26,1,26,6],[27,3,27,6],[28,1,28,6],[29,3,29,6],[30,3,30,6],[31,3,31,6],[32,3,32,6],[46,1,46,6],[47,1,47,6],[48,1,48,6],[49,1,49,6],[34,1,34,6],[36,1,36,6],[43,1,43,6],[44,1,44,6],[45,1,45,6]]}
[null,"WRAPPERS — Tax Wrapper Inventory & Contributions"]
[null,"Every tax-advantaged account  ·  Carry forward  ·  Contribution optimisation"]
[]
[null,"  WRAPPER REGISTRY — Current Balances & Contributions"]
[null,"Wrapper","Balance (£)","Annual Contrib (£)","Employer Match (£)","Proj. Value at Ret. (£)","Notes"]
[null,"  Workplace DC Pension",0,0,0,0,"Enter current value from pension provider statement"]
[null,"  SIPP (Personal Pension)",0,0,0,0]
[null,"  Stocks & Shares ISA",0,0,0,0]
[null,"  Cash ISA",0,0,0,0]
[null,"  Lifetime ISA (LISA)",0,0,0,0,"25% govt bonus on up to £4,000/yr. Max property £450k"]
{"$rows_left_out":41}
{"sheet":"Allocation","index":6,"n_rows":29,"n_cols":7,"rows_kept":29,"cut":false,"hidden":false,"merged":[[0,1,0,6],[1,1,1,6],[3,1,3,6],[7,1,7,6],[19,1,19,6]]}
[null,"ALLOCATION — Asset Allocation & Glide Path"]
[null,"Target allocations by risk profile  ·  Rebalancing alerts  ·  Current vs target"]
[]
[null,"  RISK PROFILE (set on Start Here sheet)"]
[null,"  Your selected risk profile","(links to Start Here answer)"]
[null,"  Years to retirement","(calculated from DOB and target age)"]
[]
[null,"  TARGET ALLOCATION BY PROFILE"]
[null,"Asset Class","Cautious","Balanced","Adventurous","Your Target %","Notes"]
[null,"  Global Equities","20%","45%","65%",null,"Infrastructure / long-term growth"]
{"$rows_left_out":20}
{"sheet":"State Pension","index":7,"n_rows":26,"n_cols":5,"rows_kept":26,"cut":false,"hidden":false,"merged":[[25,1,25,4],[0,1,0,4],[1,1,1,4],[3,1,3,4],[10,1,10,4],[17,1,17,4]]}
[null,"STATE PENSION — NI Record & Forecast"]
[null,"Full New State Pension  ·  NI gap ROI  ·  Deferral analysis"]
[]
[null,"  NI RECORD"]
[null,"Item","Your Value","Required","Status"]
[null,"  NI qualifying years to date",0,35,"Enter value from gov.uk/check-national-insurance-record"]
[null,"  Target qualifying years for full pension",35,35,"From Assumptions sheet"]
[null,"  Gap years to fill",{"$f":"MAX(0,C6-C5)","v":{"$error":"#VALUE!"}},null,"Calculated"]
[null,"  Years to State Pension Age (est.)",0,0,"Enter manually or see note below"]
[]
{"$rows_left_out":17}
{"sheet":"Income Streams","index":8,"n_rows":31,"n_cols":7,"rows_kept":31,"cut":false,"hidden":false,"merged":[[0,1,0,6],[1,1,1,6],[3,1,3,6],[23,1,23,6],[24,1,24,6],[30,1,30,6],[25,1,25,6],[26,1,26,6],[27,1,27,6],[28,1,28,6],[29,1,29,6]]}
[null,"INCOME STREAMS — All Retirement Income Sources"]
[null,"Every source  ·  Drawdown sequencing  ·  Tax optimisation"]
[]
[null,"  RETIREMENT INCOME REGISTRY"]
[null,"Income Source","Annual Amount (£)","Currency","Start Age","Taxable?","Notes"]
[null,"  UK State Pension",11973,"GBP",66,"Yes","Triple lock. 2025/26: £230.25/wk"]
[null,"  Workplace DC Pension — Drawdown",0,"GBP",0,"75% taxable","25% TFC. Remainder taxed as income"]
[null,"  SIPP — Drawdown",0,"GBP",0,"75% taxable","As workplace pension"]
[null,"  Stocks & Shares ISA",0,"GBP",0,"No","Fully tax-free withdrawal"]
[null,"  Cash ISA",0,"GBP",0,"No","Fully tax-free"]
{"$rows_left_out":22}
{"sheet":"Monthly Tracker","index":9,"n_rows":660,"n_cols":13,"rows_kept":660,"cut":false,"hidden":false,"merged":[[0,1,0,12],[1,1,1,12],[3,1,3,12],[608,1,608,12]]}
[null,"MONTHLY TRACKER — Portfolio & Cash Flow Log"]
[null,"Log actual values monthly  ·  5-minute ritual  ·  One-off income & expenses tracked  ·  Flows into projection automatically"]
[]
[null,"HOW TO USE: Each month enter your total portfolio value (col D). Enter any ONE-OFF INCOME received (col J: bonus, rental payment, inheritance, tax refund, windfall). Enter any ONE-OFF EXPENSE paid (col K: school fees, tax bill, property repair, legal fees). Col L calculates the net. These values flow directly into the Projection Engine year totals. Regular monthly contributions go on the Wrappers sheet, not here."]
[]
[null,"Month","Year","Portfolio Total (£)","MoM Change (£)","MoM Change %","YTD Change (£)","Cumul. Contribs (£)","Signal","ONE-OFF INCOME (£)","ONE-OFF EXPENSE (£)","One-Off Net (£)","Description / Notes"]
[null,"Jan",2026,null,null,null,null,null,null,null,null,{"$f":"IF(AND(J7=\"\",K7=\"\"),\"\",IF(J7=\"\",0,J7)-IF(K7=\"\",0,K7))","v":""}]
[null,"Feb",2026,null,{"$f":"IF(OR(D8=\"\",D7=\"\"),\"\",D8-D7)","v":""},{"$f":"IFERROR(IF(OR(D8=\"\",D7=\"\",D7=0),\"\",(D8-D7)/D7),\"\")","v":""},{"$f":"IF(OR(D8=\"\",D7=\"\"),\"\",D8-D7)","v":""},null,null,null,null,""]
[null,"Mar",2026,null,"","",{"$f":"IF(OR(D9=\"\",D7=\"\"),\"\",D9-D7)","v":""},null,null,null,null,""]
[null,"Apr",2026,null,"","",{"$f":"IF(OR(D10=\"\",D7=\"\"),\"\",D10-D7)","v":""},null,null,null,null,""]
{"$rows_left_out":651}
{"sheet":"Projection","index":10,"n_rows":77,"n_cols":12,"rows_kept":77,"cut":false,"hidden":false,"merged":[[0,1,0,11],[1,1,1,11],[2,1,2,11],[71,1,71,11],[73,1,73,4],[73,5,73,11],[74,1,74,4],[74,5,74,11],[75,1,75,4],[75,5,75,11],[76,1,76,4],[76,5,76,11]]}
[null,"PROJECTION ENGINE — Year-by-Year Lifetime Forecast"]
[null,"Read only  ·  Auto-calculated  ·  Accumulation to retirement  ·  Decumulation through life expectancy"]
[null,"Enter your Date of Birth and Target Retirement Age on Start Here to activate this projection. One-off income and expenses are pulled from the Monthly Tracker sheet annually."]
[]
[null,"Age","Year","Phase","Salary (£)","Pension Contrib (£)","Child Costs (£)","One-Off Income (£)","One-Off Expense (£)","Portfolio Value (£)","Annual Income (£)","Tax Estimate (£)"]
[null,"Your age",2026,"Accumulation","(from Start Here)",{"$f":"IFERROR(E6*0.08,0)","v":0},0,{"$f":"IFERROR(SUMIF('Monthly Tracker'!C7:C606,C6,'Monthly Tracker'!J7:J606),0)","v":0},{"$f":"IFERROR(SUMIF('Monthly Tracker'!C7:C606,C6,'Monthly Tracker'!K7:K606),0)","v":0},"(enter on Start Here)",{"$f":"IFERROR(E6+11973,0)","v":0},{"$f":"IFERROR(MAX(0,MIN(K6,50270)-12570)*0.2+MAX(0,K6-50270)*0.4,0)","v":0}]
[null,{"$f":"B6+1","v":{"$error":"#VALUE!"}},2027,"Accumulation",{"$f":"IFERROR(E6*1.03,0)","v":0},0,0,{"$f":"IFERROR(SUMIF('Monthly Tracker'!C7:C606,C7,'Monthly Tracker'!J7:J606),0)","v":0},{"$f":"IFERROR(SUMIF('Monthly Tracker'!C7:C606,C7,'Monthly Tracker'!K7:K606),0)","v":0},{"$f":"IFERROR(J6*1.065+F7+H7-I7,0)","v":0},11973,0]
[null,{"$error":"#VALUE!"},2028,"Accumulation",0,0,0,{"$f":"IFERROR(SUMIF('Monthly Tracker'!C7:C606,C8,'Monthly Tracker'!J7:J606),0)","v":0},{"$f":"IFERROR(SUMIF('Monthly Tracker'!C7:C606,C8,'Monthly Tracker'!K7:K606),0)","v":0},0,11973,0]
[null,{"$error":"#VALUE!"},2029,"Accumulation",0,0,0,{"$f":"IFERROR(SUMIF('Monthly Tracker'!C7:C606,C9,'Monthly Tracker'!J7:J606),0)","v":0},{"$f":"IFERROR(SUMIF('Monthly Tracker'!C7:C606,C9,'Monthly Tracker'!K7:K606),0)","v":0},0,11973,0]
[null,{"$error":"#VALUE!"},2030,"Accumulation",0,0,0,{"$f":"IFERROR(SUMIF('Monthly Tracker'!C7:C606,C10,'Monthly Tracker'!J7:J606),0)","v":0},{"$f":"IFERROR(SUMIF('Monthly Tracker'!C7:C606,C10,'Monthly Tracker'!K7:K606),0)","v":0},0,11973,0]
{"$rows_left_out":68}
{"sheet":"Monte Carlo","index":11,"n_rows":26,"n_cols":4,"rows_kept":26,"cut":false,"hidden":false,"merged":[[0,1,0,4],[1,1,1,4],[3,1,3,4],[14,1,14,4],[16,2,16,4],[22,2,22,4],[23,2,23,4],[25,1,25,4],[17,2,17,4],[18,2,18,4],[19,2,19,4],[20,2,20,4],[21,2,21,4]]}
[null,"MONTE CARLO — Probability of Success"]
[null,"1,000 simulations  ·  Run via VBA macro  ·  Results are advisory"]
[]
[null,"  SIMULATION PARAMETERS"]
[null,"Parameter","Value","Source"]
[null,"  Equity return assumption","6.5%","S13 Assumptions"]
[null,"  Equity standard deviation","15.0%","S13 Assumptions"]
[null,"  Bond return assumption","3.0%","S13 Assumptions"]
[null,"  Bond standard deviation","6.0%","S13 Assumptions"]
[null,"  Inflation assumption","2.5%","S13 Assumptions"]
{"$rows_left_out":17}
{"sheet":"Scenarios","index":12,"n_rows":18,"n_cols":6,"rows_kept":18,"cut":false,"hidden":false,"merged":[[0,1,0,5],[1,1,1,5],[12,1,12,5]]}
[null,"SCENARIOS — Parallel Planning"]
[null,"Base  ·  Optimistic  ·  Conservative  ·  Stress Test"]
[]
[null,"Assumption","Base","Optimistic","Conservative","Stress Test"]
[null,"  Investment return","6.5%","7.5%","5.5%","3.5%"]
[null,"  Inflation","2.5%","2.0%","3.5%","4.5%"]
[null,"  Retirement age","As set","2 yrs earlier","2 yrs later","3 yrs later"]
[null,"  Inheritance","No","Full value","50% / 5yr late","No"]
[null,"  Care costs","No","No","Yes","Yes — 3 yrs"]
[null,"  Market crash yr 3","No","No","No","Yes — 30% loss"]
{"$rows_left_out":9}
{"sheet":"Care Costs","index":13,"n_rows":18,"n_cols":5,"rows_kept":18,"cut":false,"hidden":false,"merged":[[0,1,0,4],[1,1,1,4],[3,1,3,4],[10,1,10,4]]}
[null,"CARE COSTS — Later Life Planning"]
[null,"Residential and home care  ·  Reserve target  ·  LA means test"]
[]
[null,"  CARE COST BENCHMARKS 2025/26 (LaingBuisson)"]
[null,"Care Type","Annual Cost (£)",null,"Source"]
[null,"  Residential care (average UK)",50400,null,"LaingBuisson Care Homes UK Market 2025/26"]
[null,"  Home care (average UK)",25000,null,"LaingBuisson Homecare Market 2025/26"]
[null,"  Healthcare CPI assumption","3.5%",null,"Historical healthcare inflation"]
[null,"  LA means test asset threshold (£)",23250,null,"Care Act 2014"]
[]
{"$rows_left_out":9}
{"sheet":"Market Data","index":14,"n_rows":43,"n_cols":6,"rows_kept":43,"cut":false,"hidden":false,"merged":[[0,1,0,5],[1,1,1,5],[4,1,4,5],[6,1,6,5],[7,2,7,5],[8,2,8,5],[9,2,9,5],[10,2,10,5],[11,2,11,5],[12,2,12,4],[27,2,27,5],[29,1,29,5],[40,1,40,5],[42,1,42,5],[13,1,13,5],[15,1,15,5],[24,1,24,5],[25,2,25,5],[26,2,26,5]]}
[null,"MARKET DATA — Live Feeds & Currency Registry"]
[null,"VBA fetches live data from public APIs (BoE, ONS, ECB)  ·  No paid subscription required  ·  Anthropic API key required for AI Tax Refresh only"]
[]
[]
[null,"  Single click to run  ·  Save as .xlsm first to enable macros  ·  Fetches: BoE rate, CPI, gilt yield, ONS earnings/HPI, ECB FX  ·  All sources are free public APIs (no key needed for market data)"]
[]
[null,"  GOOGLE GEMINI API KEY  —  FREE  ·  required for AI Tax Refresh  ·  NOT needed for market data"]
[null,"  STEP 1 — Open your browser and go to the URL in the next cell:","https://aistudio.google.com/app/apikey"]
[null,"  STEP 2 — Sign in with your Google / Gmail account."]
[null,"  STEP 3 — Click “Create API key” then “Create API key in new project”."]
{"$rows_left_out":34}
{"sheet":"Assumptions","index":15,"n_rows":72,"n_cols":6,"rows_kept":72,"cut":false,"hidden":false,"merged":[[30,1,30,5],[41,1,41,5],[52,1,52,5],[71,1,71,5],[0,1,0,5],[1,1,1,5],[4,1,4,5],[14,1,14,5],[22,1,22,5]]}
[null,"ASSUMPTIONS — All Modelling Parameters"]
[null,"All formulas reference these values  ·  Yellow = user override  ·  Blue = hardcoded 2025/26 HMRC values  ·  Sources documented"]
[]
[null,"Parameter","2025/26 Value","User Override","Source","Confidence"]
[null,"  UK INCOME TAX — ENGLAND 2025/26"]
[null,"  Personal Allowance (£)",12570,null,"HMRC 2025/26","High"]
[null,"  Basic Rate Limit (£)",50270,null,"HMRC 2025/26","High"]
[null,"  Higher Rate Limit (£)",125140,null,"HMRC 2025/26","High"]
[null,"  PA Taper Start (£)",100000,null,"HMRC 2025/26","High"]
[null,"  Basic Rate (%)",0.2,null,"HMRC 2025/26","High"]
{"$rows_left_out":63}
{"sheet":"Disclaimer","index":16,"n_rows":27,"n_cols":2,"rows_kept":27,"cut":false,"hidden":false,"merged":[]}
[]
[]
[null,"NOT FINANCIAL ADVICE — READ BEFORE USE"]
[null,"Payslip to Payback is an educational and personal planning tool only. IT DOES NOT CONSTITUTE FINANCIAL, INVESTMENT, TAX, LEGAL OR PROFESSIONAL ADVICE OF ANY KIND. Projections are illustrative only, based on assumptions that may not reflect your personal circumstances and may be materially affected by changes to tax law, investment returns, inflation, or life events. The calculations in this workbook are prone to error. Formulas may contain mistakes. Assumptions may be outdated, incomplete, or inapplicable to your situation. Do not make any significant financial decision based solely or primarily on this tool. YOU SHOULD CONSULT A QUALIFIED, FCA-REGULATED FINANCIAL PLANNING PROFESSIONAL before making decisions involving pensions, retirement income, significant investments, inheritance, tax planning, protection needs, or any other material financial matter. The authors accept no liability for any financial loss or damage arising from use of this tool."]
[]
[null,"COPYRIGHT, LICENCE & PUBLIC DOMAIN RELEASE"]
[null,"Copyright © 2026 Polyglyph Analytica  ·  https://polyglyphanalytica.com\n\nThis workbook was built for personal use and is released into the public domain. You are free to use, copy, modify, and distribute this workbook for any purpose, commercial or non-commercial, without restriction and without requiring attribution, subject to the disclaimers in this section. \n\nTHIS WORKBOOK IS PROVIDED \"AS IS\", WITHOUT WARRANTIES OF ANY KIND, EXPRESS OR IMPLIED, INCLUDING BUT NOT LIMITED TO WARRANTIES OF MERCHANTABILITY, FITNESS FOR A PARTICULAR PURPOSE, ACCURACY, OR NON-INFRINGEMENT. IN NO EVENT SHALL THE AUTHORS BE LIABLE FOR ANY CLAIM, DAMAGES, OR OTHER LIABILITY ARISING FROM THE USE OF THIS WORKBOOK."]
[]
[null,"AI-ASSISTED TAX PARAMETER UPDATES"]
[null,"The optional AI tax refresh queries a large language model to suggest current UK tax parameters. IMPORTANT: (1) AI models can produce incorrect values. (2) AI has knowledge cutoffs. (3) Mid-year HMRC changes may not be captured. (4) AI cannot be held legally accountable. (5) ALL AI-suggested values must be verified at HMRC.gov.uk before acceptance. When AI parameters are active, all projection outputs are flagged. A full audit log of every AI query is maintained on the AuditLog sheet."]
{"$rows_left_out":18}
{"sheet":"Children & Education","index":17,"n_rows":34,"n_cols":6,"rows_kept":34,"cut":false,"hidden":false,"merged":[[28,1,28,5],[33,1,33,5],[0,1,0,5],[1,1,1,5],[3,1,3,5],[10,1,10,5],[21,1,21,5]]}
[null,"CHILDREN & EDUCATION COSTS"]
[null,"Full lifecycle  ·  Govt support  ·  Opportunity cost  ·  Freed-cash planner"]
[]
[null,"  CHILD REGISTRY (up to 4 children)"]
[null,"Child","Date of Birth","Education Pathway","Current Annual Cost (£)","Notes"]
[null,"  Child 1",null,null,0]
[null,"  Child 2",null,null,0]
[null,"  Child 3",null,null,0]
[null,"  Child 4",null,null,0]
[]
{"$rows_left_out":25}
{"sheet":"Home & Property","index":18,"n_rows":28,"n_cols":5,"rows_kept":28,"cut":false,"hidden":false,"merged":[[0,1,0,4],[1,1,1,4],[3,1,3,4],[11,1,11,4],[21,1,21,4]]}
[null,"HOME & PROPERTY GOALS"]
[null,"Deposit planner  ·  LISA tracker  ·  Competing goals  ·  Home equity as retirement asset"]
[]
[null,"  CURRENT HOUSING SITUATION"]
[null,"Item","Your Value",null,"Source / Notes"]
[null,"  Current housing status","(from Start Here)"]
[null,"  Outstanding mortgage (£)","(from Start Here)"]
[null,"  Monthly mortgage payment (£)","(from Start Here)"]
[null,"  Current estimated property value (£)",0]
[null,"  Current equity (£)",{"$f":"IF(C7=0,C8,C8-C6)","v":{"$error":"#VALUE!"}}]
{"$rows_left_out":19}
{"sheet":"Insurance & Protection","index":19,"n_rows":88,"n_cols":7,"rows_kept":88,"cut":false,"hidden":false,"merged":[[0,1,0,6],[1,1,1,6],[3,1,3,6],[4,1,4,6],[6,1,6,6],[15,1,15,6],[22,1,22,6],[27,1,27,6],[32,1,32,6],[33,1,33,6],[62,1,62,6],[69,1,69,6],[70,1,70,6],[80,1,80,6],[87,1,87,6]]}
[null,"INSURANCE & PROTECTION  ·  Cover Requirements, Register & Gap Analysis"]
[null,"Calculates recommended cover  ·  Log personal + employer policies  ·  Highlights under- or over-insurance  ·  Not financial advice"]
[]
[null,"  SECTION 1 OF 3  —  COVER REQUIREMENTS  (auto-calculated from your profile)"]
[null,"  ℹ  Figures pull from Start Here. Override any assumption using the yellow cells."]
[null,"Cover Type","Recommended Cover","Basis / Method","Key Assumption","Override Assumption","Notes"]
[null,"  LIFE INSURANCE  —  pays a lump sum on death"]
[null,"  Income replacement multiple (years)","10",null,10,null,"Rule of thumb: 10x salary. Reduce if near retirement, increase if young with dependants."]
[null,"  Life cover — income replacement element (£)",{"$f":"IFERROR('Start Here'!C11*E8,0)","v":0},"Salary × multiple",null,null,"Your gross salary × income multiple above"]
[null,"  Life cover — mortgage repayment element (£)",{"$f":"IFERROR('Start Here'!C22,0)","v":0},"Outstanding mortgage balance",null,null,"Enough to clear the mortgage on death"]
{"$rows_left_out":79}
{"sheet":"Asset Register","index":20,"n_rows":97,"n_cols":15,"rows_kept":97,"cut":false,"hidden":false,"merged":[[64,1,64,14],[82,1,82,14],[96,1,96,14],[0,1,0,14],[1,1,1,14],[3,1,3,14],[6,1,6,14],[60,1,60,14]]}
[null,"ASSET REGISTER  ·  Portfolio Valuation, Gains & CGT Liability"]
[null,"Log all assets across all wrappers  ·  Tracks cost basis, unrealised gains and estimated CGT  ·  UK 2025/26 rules (AEA £3,000)  ·  Not financial advice"]
[]
[null,"  CGT ASSUMPTIONS  —  override if needed"]
[null,"  Annual Exempt Amount (AEA) 2025/26 (£)",3000,"Assumptions!CGT_AEA",null,"  Basic-rate CGT on investments (%)",0.18,null,"  Higher-rate CGT on investments (%)",0.24]
[null,"  CGT on residential property — basic rate (%)",0.18,null,null,"  CGT on residential property — higher rate (%)",0.24,null,"  Your marginal income tax band","Higher Rate"]
[null,"  ℹ  CGT is only payable on assets held outside tax-free wrappers (ISA, SIPP, Pension). Assets marked ISA or SIPP/Pension show £0 CGT liability. CGT rates 2025/26: investments 18%/24% (basic/higher), residential property 18%/24%. AEA £3,000 applies across ALL disposals in the tax year, not per asset."]
[]
[null,"Asset Name","Asset Type","Owner","Wrapper / Account","Purchase Date","Purchase Price (£)","Acquisition Costs (£)","Total Cost Basis (£)","Current Value (£)","Unrealised Gain / Loss (£)","Gain %","Holding Period (yrs)","Est. CGT if Disposed Today (£)","Notes / Ticker / ISIN"]
[null,null,null,"You","GIA (General Investment Account)",null,0,0,{"$f":"IFERROR(G10+H10,0)","v":0},0,{"$f":"IFERROR(IF(I10+J10=0,\"\",J10-I10),\"\")","v":""},{"$f":"IFERROR(IF(I10=0,\"\",(J10-I10)/I10),\"\")","v":""},{"$f":"IFERROR(IF(F10=\"\",\"\",ROUND((TODAY()-F10)/365.25,1)),\"\")","v":""},{"$f":"IFERROR(IF((ISNUMBER(SEARCH(\"ISA\",E10))+ISNUMBER(SEARCH(\"Pension\",E10))+ISNUMBER(SEARCH(\"SIPP\",E10)))>0,0,MAX(0,K10)*IF(ISNUMBER(SEARCH(\"Property\",C10)),IF(OR(J6=\"Higher Rate\",J6=\"Additional Rate\"),G6,C6),IF(OR(J6=\"Higher Rate\",J6=\"Additional Rate\"),J5,G5))),0)","v":0}]
{"$rows_left_out":87}